{"text_format":"1","workbook":"xlsx","n_sheets":9,"sheets":["Extras","Disclaimers","Glossary","Population & Product Type Model","Density_Comparison_Model","Error_Adjust","Equation","Guide to Product Types","Guide to GPSF"],"not_rendered":{"charts":8,"images":10,"macros":1,"external_links":1,"defined_names":38,"comments":3,"pivot_tables":0},"unopened":[],"bounds":{"document_bytes":16777216,"sheet_cells":100000,"rows_first":2000,"rows_last":500,"rows_between":2000,"halvings":0,"cell_chars":16384,"cell_head_chars":4096},"cells_cut":0,"cells_raw":0,"read":"whole","date_system":"1900"}

{"sheet":"Extras","index":0,"n_rows":577,"n_cols":9,"rows_kept":577,"cut":false,"hidden":true,"merged":[]}
["TAZ","Neighborhood",null,"Neighborhoods","TAZs in Neighborhood","List (TAZ count)"]
[401010,{"$f":"VLOOKUP(A2,[1]Neighborhood_Pivot_Paste!$A$2:$CC$577,81,FALSE)","v":"Regis"},null,"Athmar Park",5,{"$f":"D2&\" \"&\"(\"&E2&\")\"","v":"Athmar Park (5)"}]
[401020,{"$f":"VLOOKUP(A3,[1]Neighborhood_Pivot_Paste!$A$2:$CC$577,81,FALSE)","v":"Regis"},null,"Auraria",5,{"$f":"D3&\" \"&\"(\"&E3&\")\"","v":"Auraria (5)"}]
[401030,{"$f":"VLOOKUP(A4,[1]Neighborhood_Pivot_Paste!$A$2:$CC$577,81,FALSE)","v":"Regis"},null,"Baker",6,"Baker (6)"]
[401040,{"$f":"VLOOKUP(A5,[1]Neighborhood_Pivot_Paste!$A$2:$CC$577,81,FALSE)","v":"Regis"},null,"Barnum",2,"Barnum (2)"]
[401050,{"$f":"VLOOKUP(A6,[1]Neighborhood_Pivot_Paste!$A$2:$CC$577,81,FALSE)","v":"Regis"},null,"Barnum West",2,"Barnum West (2)"]
[401060,{"$f":"VLOOKUP(A7,[1]Neighborhood_Pivot_Paste!$A$2:$CC$577,81,FALSE)","v":"Chaffee Park"},null,"Bear Valley",1,"Bear Valley (1)"]
[401070,{"$f":"VLOOKUP(A8,[1]Neighborhood_Pivot_Paste!$A$2:$CC$577,81,FALSE)","v":"Chaffee Park"},null,"Belcaro",6,"Belcaro (6)"]
[401080,{"$f":"VLOOKUP(A9,[1]Neighborhood_Pivot_Paste!$A$2:$CC$577,81,FALSE)","v":"Chaffee Park"},null,"Berkeley",6,"Berkeley (6)"]
[401090,{"$f":"VLOOKUP(A10,[1]Neighborhood_Pivot_Paste!$A$2:$CC$577,81,FALSE)","v":"Sunnyside"},null,"Capitol Hill",8,"Capitol Hill (8)"]
[401100,{"$f":"VLOOKUP(A11,[1]Neighborhood_Pivot_Paste!$A$2:$CC$577,81,FALSE)","v":"Sunnyside"},null,"CBD",64,"CBD (64)"]
[401110,{"$f":"VLOOKUP(A12,[1]Neighborhood_Pivot_Paste!$A$2:$CC$577,81,FALSE)","v":"Sunnyside"},null,"Chaffee Park",3,"Chaffee Park (3)"]
[401120,{"$f":"VLOOKUP(A13,[1]Neighborhood_Pivot_Paste!$A$2:$CC$577,81,FALSE)","v":"Berkeley"},null,"Cheesman Park",4,"Cheesman Park (4)"]
[401130,{"$f":"VLOOKUP(A14,[1]Neighborhood_Pivot_Paste!$A$2:$CC$577,81,FALSE)","v":"Berkeley"},null,"Cherry Creek",6,"Cherry Creek (6)"]
[401140,{"$f":"VLOOKUP(A15,[1]Neighborhood_Pivot_Paste!$A$2:$CC$577,81,FALSE)","v":"Berkeley"},null,"City Park",3,"City Park (3)",null,"Product Type","Average Density (units/acre)"]
[401150,{"$f":"VLOOKUP(A16,[1]Neighborhood_Pivot_Paste!$A$2:$CC$577,81,FALSE)","v":"Berkeley"},null,"City Park West",4,"City Park West (4)",null,"Large SF Lots",3.1611923398399764]
[401160,{"$f":"VLOOKUP(A17,[1]Neighborhood_Pivot_Paste!$A$2:$CC$577,81,FALSE)","v":"Berkeley"},null,"Civic Center",3,"Civic Center (3)",null,"Typical SF Lots",5.9425378251489755]
[401170,{"$f":"VLOOKUP(A18,[1]Neighborhood_Pivot_Paste!$A$2:$CC$577,81,FALSE)","v":"Berkeley"},null,"Clayton",4,"Clayton (4)",null,"Small Single Family Lots",10.731549278372162]
[401180,{"$f":"VLOOKUP(A19,[1]Neighborhood_Pivot_Paste!$A$2:$CC$577,81,FALSE)","v":"Sunnyside"},null,"Cole",2,"Cole (2)",null,"Small Multifamily",12.146368863357941]
[401190,{"$f":"VLOOKUP(A20,[1]Neighborhood_Pivot_Paste!$A$2:$CC$577,81,FALSE)","v":"Sunnyside"},null,"College View / South Platte",5,"College View / South Platte (5)",null,"3-Story Walkup",33.90359691808478]
[401200,{"$f":"VLOOKUP(A21,[1]Neighborhood_Pivot_Paste!$A$2:$CC$577,81,FALSE)","v":"Sunnyside"},null,"Congress Park",6,"Congress Park (6)",null,"Mid-Range Multifamily",75.357147546381825]
[401210,{"$f":"VLOOKUP(A22,[1]Neighborhood_Pivot_Paste!$A$2:$CC$577,81,FALSE)","v":"Highland"},null,"Cory - Merrill",4,"Cory - Merrill (4)",null,"High Density Multifamily",142.2703907386896]
[401220,{"$f":"VLOOKUP(A23,[1]Neighborhood_Pivot_Paste!$A$2:$CC$577,81,FALSE)","v":"Highland"},null,"Country Club",3,"Country Club (3)"]
[401230,{"$f":"VLOOKUP(A24,[1]Neighborhood_Pivot_Paste!$A$2:$CC$577,81,FALSE)","v":"West Highland"},null,"DIA",25,"DIA (25)"]
[401240,{"$f":"VLOOKUP(A25,[1]Neighborhood_Pivot_Paste!$A$2:$CC$577,81,FALSE)","v":"West Highland"},null,"East Colfax",3,"East Colfax (3)"]
[401250,{"$f":"VLOOKUP(A26,[1]Neighborhood_Pivot_Paste!$A$2:$CC$577,81,FALSE)","v":"West Highland"},null,"Elyria Swansea",10,"Elyria Swansea (10)"]
[401260,{"$f":"VLOOKUP(A27,[1]Neighborhood_Pivot_Paste!$A$2:$CC$577,81,FALSE)","v":"West Highland"},null,"Five Points",39,"Five Points (39)"]
[401270,{"$f":"VLOOKUP(A28,[1]Neighborhood_Pivot_Paste!$A$2:$CC$577,81,FALSE)","v":"Highland"},null,"Fort Logan",5,"Fort Logan (5)"]
[401280,{"$f":"VLOOKUP(A29,[1]Neighborhood_Pivot_Paste!$A$2:$CC$577,81,FALSE)","v":"Highland"},null,"Gateway / Green Valley Ranch",18,"Gateway / Green Valley Ranch (18)"]
[401290,{"$f":"VLOOKUP(A30,[1]Neighborhood_Pivot_Paste!$A$2:$CC$577,81,FALSE)","v":"Highland"},null,"Globeville",7,"Globeville (7)"]
{"$rows_left_out":548}
{"sheet":"Disclaimers","index":1,"n_rows":15,"n_cols":1,"rows_kept":15,"cut":false,"hidden":false,"merged":[]}
["Purpose:"]
["The purpose of this spreadsheet is to provide land use planners a tool for understanding the potential differences in water demand for different situations of new residential development. It is the hopes of the authors that this tool can be used to facilitate the sharing of knowledge among land use and water professionals."]
[]
["Intentions:"]
["It is the intention of the authors that this tool serve as a means to promote integration and conversation among land use planners and the water resources community."]
["It is not the intention of the authors for this tool to be the sole source of information used for decision making."]
[]
["What this tool does:"]
["This tool provide relative water demand comparisons among hypothetical development scenarios for new residential development."]
["This tool allows the user to tailor new residential development scenarios and evaluate the relative differences in land use and water demand."]
[]
["What this tool does not do:"]
["This tool does not take into account any water demands beyond those occuring on residential parcels. Therefore, it lacks the full picture of the water demands associated with the residential development scenario."]
["This tool is not a predictive model for local, regional, state, or national water demand forecasting and should not be used in place of any such models."]
["This tool does not take into account any localized land use policy, codes or ordinances."]

{"sheet":"Glossary","index":2,"n_rows":13,"n_cols":2,"rows_kept":13,"cut":false,"hidden":false,"merged":[]}
["Term","Definition"]
[]
["Acre-Feet (AF)","A volume of water often used in the water resources community. One acre-foot is equal to 325,851 gallons."]
["Dwelling Unit (Unit)","A structure that is used as a home or residence."]
["GPCD","Gallons per capita per day "]
["GPSF","Gallons per square foot annually"]
["Household","An occupied dwelling unit."]
["Indoor Water Use","Water used for domestic purposes such as cooking, cleaning, bathing and toilet flushing."]
["kgal","Thousands of gallons"]
["Outdoor Water Use","Water used primarily for landscape irrigation purposes. Other outdoor water uses can include car washing and power washing."]
["Product Type","A category of residential development. Each product type has unique characteristics that distinguish it from other residential development types."]
["Seasonal Water Use","Seasonal water use is similar to outdoor water use in that it is highest during summer months and can include water used for landscape irrigation. The important distinction between seasonal water use and outdoor water use is that landscape irrigatoin is not necessarily the primary use of the water, though it may be. For example, some high density buildings have evaporative cooling systems that increase the building's water use during warmer months in a similar pattern to irrigation water use at parcels with irrigated landscapes. Though the water demand for evaporative cooling may exhibit a similar seasonal pattern as irrigation water demand, it is not an outdoor water demand. However, in instances where there is increased demand in summer months due to landscape irrigation needs, that demand can still be characterized as a seasonal use because it is unique to the summer season."]
["Xeriscape","A style of landscape design requiring little or no irrigation or other maintenance, used in arid regions."]

{"sheet":"Population & Product Type Model","index":3,"n_rows":52,"n_cols":15,"rows_kept":52,"cut":false,"hidden":false,"merged":[[42,12,42,14],[9,0,9,3],[45,12,49,15],[51,12,55,15],[4,0,4,9],[9,11,9,16],[40,0,40,9],[27,0,27,3],[9,5,9,9]]}
["Population and Product Type Model"]
[]
["Instructions:"]
["Section 1: Enter the planned population in cell B13 and distribute that population by residential product type in the rows below. Create and compare up to three scenarios. Scenarios can be named in cells B12:D12. "]
["Section 2: Develop assumptions for your scenarios by entering values in the blue cells in Section 2; Section 3 provides a guide to the assumptions. Sections 4 & 5 provide the model's outputs."]
[]
["Key:"]
["Changeable User Input","Calculated Output"]
[]
["Section 1. Population Distribution by Product Type",null,null,null,null,"Section 2. User Assumptions (see Section 3 for Assumption Guidance)",null,null,null,null,null,"Section.  Assumption Guidance"]
[]
["Scenario Name"]
["Total Population:",null,{"$f":"B13","v":0},{"$f":"B13","v":0},null,null,"Persons per Household","Indoor GPCD","Avg. Units per Acre","Seasonal GPSF (pervious)",null,null,"Indoor GPCD Guide","Typical GPCD Range"]
["     Large Single Family",null,null,null,null,"Large Single Family",null,null,null,null,null,null,"Inefficient","> 60"]
["     Typical Single Family",null,null,null,null,"Typical Single Family",null,null,null,null,null,null,"Federal Fixture Standards","45-60"]
["     Small Single Family",null,null,null,null,"Small Single Family",null,null,null,null,null,null,"State (CO) Fixture Standards","35-45"]
["     Small Multifamily",null,null,null,null,"Small Multifamily",null,null,null,null,null,null,"Efficient at Currently Available Technology","25-35"]
["     3-Story Walkup",null,null,null,null,"3-Story Walkup",null,null,null,null,null,null,"Indoor GPCD Examples","Theoretical Minimum","Efficient"]
["     Mid-Range Multifamily",null,null,null,null,"Mid-Range Multifamily",null,null,null,null,null,null,"Large Single Family",25,40]
["     High Density Multifamily",null,null,null,null,"High Density Multifamily",null,null,null,null,null,null,"Typical Single Family",25,40]
[null,{"$f":"IF(B13-SUM(B14:B20)=0,\"\",IF(B13-SUM(B14:B20)=1,\"Add \"&B13-SUM(B14:B20)&\" Person\",IF(B13-SUM(B14:B20)=-1,\"Remove \"&B13-SUM(B14:B20)&\" Person\",IF(B13-SUM(B14:B20)>0,\"Add \"&B13-SUM(B14:B20)&\" People\",\"Remove \"&B13-SUM(B14:B20)&\" People\"))))","v":""},{"$f":"IF(C13-SUM(C14:C20)=0,\"\",IF(C13-SUM(C14:C20)=1,\"Add \"&C13-SUM(C14:C20)&\" Person\",IF(C13-SUM(C14:C20)=-1,\"Remove \"&C13-SUM(C14:C20)&\" Person\",IF(C13-SUM(C14:C20)>0,\"Add \"&C13-SUM(C14:C20)&\" People\",\"Remove \"&C13-SUM(C14:C20)&\" People\"))))","v":""},{"$f":"IF(D13-SUM(D14:D20)=0,\"\",IF(D13-SUM(D14:D20)=1,\"Add \"&D13-SUM(D14:D20)&\" Person\",IF(D13-SUM(D14:D20)=-1,\"Remove \"&D13-SUM(D14:D20)&\" Person\",IF(D13-SUM(D14:D20)>0,\"Add \"&D13-SUM(D14:D20)&\" People\",\"Remove \"&D13-SUM(D14:D20)&\" People\"))))","v":""},null,null,null,null,null,null,null,null,"Small Single Family",25,40]
[null,null,null,null,null,null,null,null,null,null,null,null,"Small Multifamily",25,40]
[null,null,null,null,null,null,null,null,null,null,null,null,"3-Story Walkup",25,40]
[null,null,null,null,null,null,null,null,null,null,null,null,"Mid-Range Multifamily",25,40]
[null,null,null,null,null,null,null,null,null,null,null,null,"High Density Multifamily",25,40]
[]
[null,null,null,null,null,null,null,null,null,null,null,null,"Dwelling Units per Acre Guide","Typical Range"]
["Table 4. Model Output",null,null,null,null,null,null,null,null,null,null,null,"Large Single Family","2 to 4 units per acre"]
[null,null,null,null,null,null,null,null,null,null,null,null,"Typical Single Family","5 to 10 units per acre"]
["Scenario Name",{"$f":"B12","v":0},{"$f":"C12","v":0},0,null,null,null,null,null,null,null,null,"Small Single Family","10 to 15 units per acre"]
{"$rows_left_out":23}
{"sheet":"Density_Comparison_Model","index":4,"n_rows":53,"n_cols":15,"rows_kept":53,"cut":false,"hidden":false,"merged":[[10,11,10,16],[43,12,43,14],[10,0,10,2],[46,12,50,15],[52,12,56,15]]}
["Residential Density Comparison Model"]
[]
["Instructions:"]
["This model allows the user to examine changes in water demand from changes in land use and/or efficiency."]
["Section 1: Enter scenario assumptions in the blue cells. Section 2 provides a guide to the assumptions."]
["Sections 3 & 4 provide the model's output."]
[]
["Key:"]
["Changeable Input","Calculated Output"]
[]
["Section 1. Development & Water Use Characteristics",null,null,null,null,null,null,null,null,null,null,"Section 2.  Assumption Guidance"]
[]
["Scenario Name"]
["   Acres",null,{"$f":"IF(B14=\"\",\"\",B14)","v":""},null,null,null,null,null,null,null,null,null,"Indoor GPCD Guide","Typical GPCD Range"]
["   Dwelling Units",null,null,null,null,null,null,null,null,null,null,null,"Inefficient","> 60"]
["   Avg. Persons per Household",null,null,null,null,null,null,null,null,null,null,null,"Federal Fixture Standards","45-60"]
["   Indoor Gallons per Capita per Day",null,null,null,null,null,null,null,null,null,null,null,"State Fixture Standards","35-45"]
["   Seasonal Gallons per Pervious Square Foot",null,null,null,null,null,null,null,null,null,null,null,"Efficient at Currently Available Technology","25-35"]
["   Dwelling Units per Acre",{"$f":"B15/B14","v":{"$error":"#DIV/0!"}},{"$f":"C15/C14","v":{"$error":"#VALUE!"}},null,null,null,null,null,null,null,null,null,"Indoor GPCD Observations","Theoretical Minimum","Efficient"]
["   Most Likely Product Type ",{"$f":"IFERROR(INDEX(Extras!$H$16:$H$22,MATCH(INDEX(Extras!$I$16:$I$22,MATCH(MIN(ABS(Extras!$I$16:$I$22-(Density_Comparison_Model!$B15/B14))),ABS(Extras!$I$16:$I$22-(Density_Comparison_Model!$B15/B14)),0)),Extras!$I$16:$I$22,0)),\"\")","v":""},{"$f":"IFERROR(INDEX(Extras!$H$16:$H$22,MATCH(INDEX(Extras!$I$16:$I$22,MATCH(MIN(ABS(Extras!$I$16:$I$22-(Density_Comparison_Model!$C15/C14))),ABS(Extras!$I$16:$I$22-(Density_Comparison_Model!$C15/C14)),0)),Extras!$I$16:$I$22,0)),\"\")","v":""},null,null,null,null,null,null,null,null,null,"Large Single Family",25,40]
["   Average Pervious Square Feet per Unit",{"$f":"IFERROR((Equation!$B$1*(B15/B14)^Equation!$B$2)+(VLOOKUP(ROUND(B15/B14,0),Error_Adjust!$A$2:$B$209,2,FALSE)),\"\")","v":""},{"$f":"IFERROR(Equation!$B$1*((C15/C14)^Equation!$B$2)+(VLOOKUP(ROUND(C15/C14,0),Error_Adjust!$A$2:$B$209,2,FALSE)),\"\")","v":""},null,null,null,null,null,null,null,null,null,"Typical Single Family",25,40]
[null,null,null,null,null,null,null,null,null,null,null,null,"Small Single Family",25,40]
[null,null,null,null,null,null,null,null,null,null,null,null,"Small Multifamily",25,40]
["Section 3. Annual Demand Summary",null,null,null,null,null,null,null,null,null,null,null,"3-Story Walkup",25,40]
[null,null,null,null,null,null,null,null,null,null,null,null,"Mid-Range Multifamily",25,40]
["Scenario Name",{"$f":"B13","v":0},{"$f":"C13","v":0},"∆","%∆",null,null,null,null,null,null,null,"High Density Multifamily",25,40]
["   Annual Indoor Demand, AF",{"$f":"IFERROR((((B15*B16)*B17*365)/325851),\"\")","v":0},{"$f":"(((C15)*C16)*C17*365)/325851","v":0},{"$f":"C27-B27","v":0},{"$f":"IFERROR(D27/B27,\"\")","v":""}]
["   Annual Seasonal Demand, AF",{"$f":"IFERROR((((B15)*B21)*B18)/325851,\"\")","v":""},{"$f":"IFERROR((((C15)*C21)*C18)/325851,\"\")","v":""},{"$f":"IFERROR(C28-B28,\"\")","v":""},"",null,null,null,null,null,null,null,"Dwelling Units per Acre Guide","Typical Range"]
["   Annual Total Demand, AF",{"$f":"IFERROR(B27+B28,\"\")","v":""},{"$f":"IFERROR(C27+C28,\"\")","v":""},{"$f":"C29-B29","v":{"$error":"#VALUE!"}},"",null,null,null,null,null,null,null,"Large Single Family","2 to 4 units per acre"]
["   Annual Total Demand, kgal",{"$f":"($B$29*325.851)","v":{"$error":"#VALUE!"}},{"$f":"($C$29*325.851)","v":{"$error":"#VALUE!"}},{"$f":"C30-B30","v":{"$error":"#VALUE!"}},"",null,null,null,null,null,null,null,"Typical Single Family","5 to 10 units per acre"]
{"$rows_left_out":24}
{"sheet":"Error_Adjust","index":5,"n_rows":209,"n_cols":2,"rows_kept":209,"cut":false,"hidden":true,"merged":[]}
["Rounded Units per Acre","Average Error (observed minus modeled)"]
[0,-44653.221460856163]
[1,1184.1821397638755]
[2,32.741019465999571]
[3,-92.058925366887749]
[4,112.24564793484711]
[5,219.34861659087773]
[6,72.449595471633984]
[7,-65.968619646679898]
[8,-33.779492458563269]
[9,45.974655747820904]
[10,18.094300775599613]
[11,35.473029534600506]
[12,228.68026638256541]
[13,228.41442390189519]
[14,156.4548657172038]
[15,128.7595413897964]
[16,196.08337483011761]
[17,155.77408838545844]
[18,87.015404518881169]
[19,144.70918792585974]
[20,114.00753280636299]
[21,117.90610557762461]
[22,61.379974553829214]
[23,88.600733829139301]
[24,113.00674604534279]
[25,112.99113620935027]
[26,84.446370264553991]
[27,28.374645481769075]
[28,41.403915994538529]
{"$rows_left_out":180}
{"sheet":"Equation","index":6,"n_rows":5,"n_cols":4,"rows_kept":5,"cut":false,"hidden":true,"merged":[]}
["Dummy Int",30001]
["Dummy Exp",-1.167]
[null,null,null,"y=30,001*x^-1.167"]
["where:"]
["x equals units per acre"]

{"sheet":"Guide to Product Types","index":7,"n_rows":108,"n_cols":13,"rows_kept":108,"cut":false,"hidden":false,"merged":[[79,0,83,11],[79,12,83,23],[107,0,111,11],[26,12,27,22],[26,0,27,10],[53,0,54,10],[53,12,54,22]]}
[]
["BACK TO POPULATION & PRODUCT TYPE MODEL",null,null,null,null,null,null,null,"BACK TO DENSITY COMPARISON MODEL"]
[]
[]
[]
[]
[]
[]
[]
[]
[]
[]
[]
[]
[]
[]
[]
[]
[]
[]
[]
[]
[]
[]
[]
[]
["The large single family product type consists of detached single dwelling unit parcels with parcels size greater than or equal to 10,000 square feet.",null,null,null,null,null,null,null,null,null,null,null,"The typical single family product type consists of detached single dwelling unit parcels with parcel area between 5,000 and 10,000 square feet."]
[]
[]
[]
{"$rows_left_out":79}
{"sheet":"Guide to GPSF","index":8,"n_rows":4,"n_cols":12,"rows_kept":4,"cut":false,"hidden":false,"merged":[]}
[]
[null,null,null,null,null,null,null,null,null,null,null,"BACK TO POPULATION & PRODUCT TYPE MODEL"]
[]
[null,null,null,null,null,null,null,null,null,null,null,"BACK TO DENSITY COMPARISON MODEL"]